Target
Cholesteryl ester transfer protein
Ligand
BDBM50276581
Substrate
Meas. Tech.
ChEMBL_44154 (CHEMBL653305)
IC50
5000±n/a nM
Citation
 Coval, SJConover, MAMierzwa, RKing, APuar, MSPhife, DWPai, JBurrier, REAhn, HBoykow, GCPatel, MPomponi, SA Wiedendiol-A and -B, cholesteryl ester transfer protein inhibitors from the marine sponge Xestospongia wiedenmayeri Bioorg Med Chem Lett 5:605-610 (1995)    Article 
Target
Name:
Cholesteryl ester transfer protein
Synonyms:
CETP Cholesteryl ester transfer protein (CETP) | Lipid transfer protein I
Type:
Enzyme
Mol. Mass.:
54751.53
Organism:
Homo sapiens (Human)
Description:
P11597
Residue:
493
  
Inhibitor
Name:
BDBM50276581
Synonyms:
(+/-)-wiedendiol B | CHEMBL456619
Type:
Small organic molecule
Emp. Form.:
C22H32O3
Mol. Mass.:
344.4877
SMILES:
COc1ccc(O)c(O)c1\C=C1/[C@@H](C)CC[C@H]2C(C)(C)CCC[C@]12C
: