Target
Cholesteryl ester transfer protein
Ligand
BDBM50242257
Substrate
Meas. Tech.
ChEMBL_44154 (CHEMBL653305)
IC50
25000±n/a nM
Citation
 Coval, SJConover, MAMierzwa, RKing, APuar, MSPhife, DWPai, JBurrier, REAhn, HBoykow, GCPatel, MPomponi, SA Wiedendiol-A and -B, cholesteryl ester transfer protein inhibitors from the marine sponge Xestospongia wiedenmayeri Bioorg Med Chem Lett 5:605-610 (1995)    Article 
Target
Name:
Cholesteryl ester transfer protein
Synonyms:
CETP Cholesteryl ester transfer protein (CETP) | Lipid transfer protein I
Type:
Enzyme
Mol. Mass.:
54751.53
Organism:
Homo sapiens (Human)
Description:
P11597
Residue:
493
  
Inhibitor
Name:
BDBM50242257
Synonyms:
2-((1R,2S,4aS)-1,2,4a,5-Tetramethyl-1,2,3,4,4a,7,8,8a-octahydro-naphthalen-1-ylmethyl)-benzene-1,4-diol Avarol CHEMBL459814
Type:
Small organic molecule
Emp. Form.:
C21H30O2
Mol. Mass.:
314.4617
SMILES:
C[C@H]1CC[C@@]2(C)[C@@H](CCC=C2C)[C@]1(C)Cc1cc(O)ccc1O
: