Target
5-hydroxytryptamine receptor 3A/3B
Ligand
BDBM50122871
Substrate
Meas. Tech.
ChEBML_2977
Ki
53±n/a nM
Citation
 Langlois, MYang, DBremont, BShen, S Synthesis and pharmacological activity of a macrocyclic benzamide Bioorg Med Chem Lett 5:795-798 (1995)    Article 
Target
Name:
5-hydroxytryptamine receptor 3A/3B
Synonyms:
Serotonin 3 (5-HT3) receptor | Serotonin 3a (5-HT3a)/3b (5-HT3b) receptor
Type:
Mol. Mass.:
Description:
ASSAY_ID of EBI is 2974
Components:
This complex has 2 components.
Component 1
Name:
5-hydroxytryptamine receptor 3B
Synonyms:
5HT3B_RAT Serotonin (5-HT) receptor
Type:
PROTEIN
Mol. Mass.:
50328.78
Organism:
Rattus norvegicus
Description:
EBI_11885
Residue:
437
  
Component 2
Name:
5-hydroxytryptamine receptor 3A
Synonyms:
5-HT3 5HT3A_RAT Htr3 Serotonin (5-HT) receptor | Zacopride site-R
Type:
Enzyme Catalytic Domain
Mol. Mass.:
55428.70
Organism:
RAT
Description:
5-HT3 HTR3A RAT::P35563
Residue:
483
  
Inhibitor
Name:
BDBM50122871
Synonyms:
7-Amino-6-chloro-10,13-dioxa-2,16-diaza-tricyclo[14.2.2.0*4,9*]icosa-4,6,8-trien-3-one | CHEMBL116913
Type:
Small organic molecule
Emp. Form.:
C16H22ClN3O3
Mol. Mass.:
339.817
SMILES:
Nc1cc2OCCOCCN3CCC(CC3)NC(=O)c2cc1Cl
: