Target
5-hydroxytryptamine receptor 3A/3B
Ligand
BDBM50132693
Substrate
Meas. Tech.
ChEBML_2977
Ki
>1000±n/a nM
Citation
 Langlois, MYang, DBremont, BShen, S Synthesis and pharmacological activity of a macrocyclic benzamide Bioorg Med Chem Lett 5:795-798 (1995)    Article 
Target
Name:
5-hydroxytryptamine receptor 3A/3B
Synonyms:
Serotonin 3 (5-HT3) receptor | Serotonin 3a (5-HT3a)/3b (5-HT3b) receptor
Type:
Mol. Mass.:
Description:
ASSAY_ID of EBI is 2974
Components:
This complex has 2 components.
Component 1
Name:
5-hydroxytryptamine receptor 3B
Synonyms:
5HT3B_RAT Serotonin (5-HT) receptor
Type:
PROTEIN
Mol. Mass.:
50328.78
Organism:
Rattus norvegicus
Description:
EBI_11885
Residue:
437
  
Component 2
Name:
5-hydroxytryptamine receptor 3A
Synonyms:
5-HT3 5HT3A_RAT Htr3 Serotonin (5-HT) receptor | Zacopride site-R
Type:
Enzyme Catalytic Domain
Mol. Mass.:
55428.70
Organism:
RAT
Description:
5-HT3 HTR3A RAT::P35563
Residue:
483
  
Inhibitor
Name:
BDBM50132693
Synonyms:
4-Amino-N-(1-benzyl-piperidin-4-yl)-5-chloro-2-methoxy-benzamide 4-amino-N-(1-benzylpiperidin-4-yl)-5-chloro-2-methoxybenzamide Clebopride
Type:
Small organic molecule
Emp. Form.:
C20H24ClN3O2
Mol. Mass.:
373.876
SMILES:
COc1cc(N)c(Cl)cc1C(=O)NC1CCN(Cc2ccccc2)CC1
: