Target
Dipeptidyl peptidase 4
Ligand
BDBM50243495
Substrate
Meas. Tech.
ChEBML_53500
Ki
1200±n/a nM
Citation
 Ashworth, DMAtrash, BBaker, GRBaxter, AJJenkins, PDJones, DSzelke, M 2-cyanopyrrolidides as potent, stable inhibitors of dipeptidyl peptidase IV Bioorg Med Chem Lett 6:1163-1166 (1996)    Article 
Target
Name:
Dipeptidyl peptidase 4
Synonyms:
ADABP Adenosine deaminase complexing protein 2 CD_antigen=CD26 DPP4 DPPIV Dipeptidyl peptidase 4 (DPP IV) Dipeptidyl peptidase 4 (DPP4) Dipeptidyl peptidase 4 membrane form Dipeptidyl peptidase IV Dipeptidyl peptidase IV (DDP-IV) Dipeptidyl peptidase IV membrane form Dipeptidyl peptidase-IV (DPP-4) T-cell activation antigen CD26 | TP103
Type:
Enzyme
Mol. Mass.:
88271.01
Organism:
Homo sapiens (Human)
Description:
P27487
Residue:
766
  
Inhibitor
Name:
BDBM50243495
Synonyms:
(S)-2-amino-1-(pyrrolidin-1-yl)hexan-1-one | CHEMBL442952
Type:
Small organic molecule
Emp. Form.:
C10H20N2O
Mol. Mass.:
184.2786
SMILES:
CCCC[C@H](N)C(=O)N1CCCC1
: