Target
Dipeptidyl peptidase 4
Ligand
BDBM50287060
Substrate
Meas. Tech.
ChEBML_53500
Ki
900±n/a nM
Citation
 Ashworth, DMAtrash, BBaker, GRBaxter, AJJenkins, PDJones, DSzelke, M 2-cyanopyrrolidides as potent, stable inhibitors of dipeptidyl peptidase IV Bioorg Med Chem Lett 6:1163-1166 (1996)    Article 
Target
Name:
Dipeptidyl peptidase 4
Synonyms:
ADABP Adenosine deaminase complexing protein 2 CD_antigen=CD26 DPP4 DPPIV Dipeptidyl peptidase 4 (DPP IV) Dipeptidyl peptidase 4 (DPP4) Dipeptidyl peptidase 4 membrane form Dipeptidyl peptidase IV Dipeptidyl peptidase IV (DDP-IV) Dipeptidyl peptidase IV membrane form Dipeptidyl peptidase-IV (DPP-4) T-cell activation antigen CD26 | TP103
Type:
Enzyme
Mol. Mass.:
88271.01
Organism:
Homo sapiens (Human)
Description:
P27487
Residue:
766
  
Inhibitor
Name:
BDBM50287060
Synonyms:
3-Hydroxy-2-methylamino-1-pyrrolidin-1-yl-butan-1-one CHEMBL3350818
Type:
Small organic molecule
Emp. Form.:
C9H18N2O2
Mol. Mass.:
186.2514
SMILES:
CNC([C@H](C)O)C(=O)N1CCCC1
: