Target
Gamma-aminobutyric acid type B receptor subunit 1/2
Ligand
BDBM50287486
Substrate
Meas. Tech.
ChEBML_68565
IC50
40±n/a nM
Citation
 Ho-Jane, ShueXiao, ChenBlythin, DJCarruthers, NISpitler, JMShing-Chun, WongChapman, RWRizzo, CWest, RShe, HS A study of 3-amino-N-hydroxypropanesulfonamide derivatives as potential GABAB agonists and their fragmentation to 3-aminopropanesulfinic acid Bioorg Med Chem Lett 6:1709-1714 (1996)    Article 
Target
Name:
Gamma-aminobutyric acid type B receptor subunit 1/2
Synonyms:
GABA B receptor | GABA-B receptor 1/2
Type:
Mol. Mass.:
Description:
ASSAY_ID of EBI is 68556
Components:
This complex has 2 components.
Component 1
Name:
Gamma-aminobutyric acid type B receptor subunit 1
Synonyms:
GABA B GABA uptake GABA-B-R1 GABABR1 Gabbr1 | Gb1
Type:
Enzyme Catalytic Domain
Mol. Mass.:
111548.69
Organism:
Rattus norvegicus (Rat)
Description:
Q9Z0U4
Residue:
991
  
Component 2
Name:
Gamma-aminobutyric acid type B receptor subunit 2
Synonyms:
GABA B receptor Gabbr2 | Gpr51
Type:
PROTEIN
Mol. Mass.:
105775.46
Organism:
Rattus norvegicus
Description:
O88871
Residue:
940
  
Inhibitor
Name:
BDBM50287486
Synonyms:
3-Amino-propane-1-sulfonic acid benzyl-hydroxy-amide; hydrobromide | CHEMBL545424
Type:
Small organic molecule
Emp. Form.:
C10H16N2O3S
Mol. Mass.:
244.311
SMILES:
NCCCS(=O)(=O)N(O)Cc1ccccc1
: