Target
2-5A-dependent ribonuclease
Ligand
BDBM50366438
Substrate
Meas. Tech.
ChEMBL_164151 (CHEMBL770785)
IC50
>50000±n/a nM
Citation
 Sawai, HIto, TKokaji, KShimazu, MShinozuka, KTaira, H Synthesis and properties of 25 and 35 linked -oligoriboadenylates Bioorg Med Chem Lett 6:1785-1790 (1996)    Article 
Target
Name:
2-5A-dependent ribonuclease
Synonyms:
2-5A-dependent RNase RN5A_HUMAN RNS4 Ribonuclease 4 | Ribonuclease L
Type:
PROTEIN
Mol. Mass.:
83534.35
Organism:
Homo sapiens (Human)
Description:
ChEMBL_164152
Residue:
741
  
Inhibitor
Name:
BDBM50366438
Synonyms:
CHEMBL608875
Type:
Small organic molecule
Emp. Form.:
C29H36N15O19P3
Mol. Mass.:
991.6065
SMILES:
Nc1ncnc2n(cnc12)C1O[C@H](COP(O)(=O)O[C@@H]2[C@H](O)[C@@H](COP(O)(=O)O[C@@H]3[C@H](O)[C@@H](OP(O)(O)=O)O[C@@H]3n3cnc4c(N)ncnc34)O[C@@H]2n2cnc3c(N)ncnc23)[C@@H](O)[C@H]1O
: