Target
Tumor necrosis factor receptor superfamily member 10A
Ligand
BDBM50287632
Substrate
Meas. Tech.
ChEMBL_54694 (CHEMBL669549)
IC50
80±n/a nM
Citation
 Hanson, GJVuletich, JLBedell, LJBono, CPHoward, SCWelply, JKWoulfe, SLZacheis, ML Design of MHC class II (DR4) ligands using conformationally restricted imino acids at p3 and p5 Bioorg Med Chem Lett 6:1931-1936 (1996)    Article 
Target
Name:
Tumor necrosis factor receptor superfamily member 10A
Synonyms:
APO2 DR4 TNF-related apoptosis-inducing ligand receptor 1 TR10A_HUMAN TRAIL receptor-1 TRAILR1 | Tumor necrosis factor receptor superfamily member 10A
Type:
PROTEIN
Mol. Mass.:
50092.56
Organism:
Homo sapiens (Human)
Description:
ChEMBL_47861
Residue:
468
  
Inhibitor
Name:
BDBM50287632
Synonyms:
CHEMBL1253325 | PKYVKQNTLKLAT (HA306-318 peptide)
Type:
Small organic molecule
Emp. Form.:
C69H118N18O19
Mol. Mass.:
1503.7844
SMILES:
CC(C)C[C@H](NC(=O)[C@H](CCCCN)NC(=O)[C@H](CC(C)C)NC(=O)[C@@H](NC(=O)[C@H](CC(N)=O)NC(=O)[C@H](CCC(N)=O)NC(=O)[C@H](CCCCN)NC(=O)[C@@H](NC(=O)[C@H](Cc1ccc(O)cc1)NC(=O)[C@H](CCCCN)NC(=O)[C@@H]1CCCN1)C(C)C)[C@@H](C)O)C(=O)N[C@@H](C)C(=O)N[C@@H]([C@@H](C)O)C(O)=O
: