Target
Neuromedin-B receptor
Ligand
BDBM50288246
Substrate
Meas. Tech.
ChEBML_143206
Ki
310±n/a nM
Citation
 Eden, JHall, MHigginbottom, MHorwell, DHowson, WHughes, JJordan, RLewthwaite, RMartin, KMcKnight, APinnock, RPritchard, MSuman-Chauhan, NWilliams, S PD 165929 the first high affinity non-peptide neuromedin-B (NMB) receptor selective antagonist Bioorg Med Chem Lett 6:2617-2622 (1996)    Article 
Target
Name:
Neuromedin-B receptor
Synonyms:
Bombesin 1 NMBR Neuromedin B Neuromedin-B receptor | Neuromedin-B-preferring bombesin receptor
Type:
Enzyme Catalytic Domain
Mol. Mass.:
43447.11
Organism:
Homo sapiens (Human)
Description:
Bombesin 1 NMBR 0::P28336
Residue:
390
  
Inhibitor
Name:
BDBM50288246
Synonyms:
2-[3-(2,6-Diisopropyl-phenyl)-ureido]-3-(1H-indol-3-yl)-2-methyl-N-(1,2,3,4-tetrahydro-naphthalen-2-yl)-propionamide | CHEMBL89795
Type:
Small organic molecule
Emp. Form.:
C35H42N4O2
Mol. Mass.:
550.7336
SMILES:
CC(C)c1cccc(C(C)C)c1NC(=O)NC(C)(Cc1c[nH]c2ccccc12)C(=O)NC1CCc2ccccc2C1
: