Target
Neuraminidase
Ligand
BDBM4967
Substrate
Meas. Tech.
ChEBML_200636
IC50
3±n/a nM
Citation
 Smith, PWSollis, SLHowes, PDCherry, PCCobley, KNTaylor, HWhittington, ARScicinski, JBethell, RCTaylor, NSkarzynski, TCleasby, ASingh, OWonacott, AVarghese, JColman, P Novel inhibitors of influenza sialidases related to GG167 structure-activity, crystallographic and Molecular dynamics studies with 4H-pyran-2-carboxylic acid 6-carboxamides Bioorg Med Chem Lett 6:2931-2936 (1996)    Article 
Target
Name:
Neuraminidase
Synonyms:
Influenza A Virus Neuraminidase NRAM_I34A1 Neuraminidase A
Type:
Enzyme
Mol. Mass.:
50124.14
Organism:
Influenza A virus (A/Puerto Rico/8/34/Mount Sinai(H1N1))
Description:
P03468
Residue:
454
  
Inhibitor
Name:
BDBM4967
Synonyms:
(2R,3R,4S)-4-amino-3-acetamido-2-{[2-(4-phenylphenyl)ethyl](propyl)carbamoyl}-3,4-dihydro-2H-pyran-6-carboxylic acid | carboxamide deriv. 4aj
Type:
Small organic molecule
Emp. Form.:
C26H31N3O5
Mol. Mass.:
465.5414
SMILES:
[H][C@]1(OC(=C[C@H](N)[C@H]1NC(C)=O)C(O)=O)C(=O)N(CCC)CCc1ccc(cc1)-c1ccccc1
: