Target
Acetylcholinesterase
Ligand
BDBM50342601
Substrate
Meas. Tech.
ChEMBL_27824 (CHEMBL636714)
Ki
5.9±n/a nM
Citation
 Kozikowski, APDing, QSaxena, ADoctor, BP Synthesis of ()-10,10-dimethylhuperzine A a huperzine analogue possessing a slower enzyme off-rate Bioorg Med Chem Lett 6:259-262 (1996)    Article 
Target
Name:
Acetylcholinesterase
Synonyms:
ACES_BOVIN Acetylcholinesterase (AChE) | Acetylcholinesterase precursor
Type:
Enzyme
Mol. Mass.:
67659.62
Organism:
Bos taurus (bovine)
Description:
Residue:
613
  
Inhibitor
Name:
BDBM50342601
Synonyms:
CHEMBL1255901 | Huperzine A
Type:
Small organic molecule
Emp. Form.:
C15H18N2O
Mol. Mass.:
242.3162
SMILES:
C\C=C1/[C@@H]2Cc3[nH]c(=O)ccc3[C@]1(N)CC(C)=C2
: