Target
Sigma non-opioid intracellular receptor 1
Ligand
BDBM50033369
Substrate
Meas. Tech.
ChEBML_201726
Ki
20±n/a nM
Citation
 Kassiou, MNguyen, VHKnott, RChristie, MJHambley, TW Trishomocubanes, a new class of selective and high affinity ligands for the sigma binding site Bioorg Med Chem Lett 6:595-600 (1996)    Article 
Target
Name:
Sigma non-opioid intracellular receptor 1
Synonyms:
Aging-associated gene 8 protein SGMR1_HUMAN SIGMAR1 SR31747-binding protein Sigma 1-type opioid receptor Sigma1R | hSigmaR1
Type:
Enzyme Catalytic Domain
Mol. Mass.:
25124.85
Organism:
Homo sapiens (Human)
Description:
Q99720
Residue:
223
  
Inhibitor
Name:
BDBM50033369
Synonyms:
AMANTADINE SYMADINE | SYMMETREL
Type:
Small organic molecule
Emp. Form.:
C10H17N
Mol. Mass.:
151.2487
SMILES:
NC12CC3CC(CC(C3)C1)C2
: