Target
Acetylcholinesterase
Ligand
BDBM50342601
Substrate
Meas. Tech.
ChEBML_28155
IC50
150±n/a nM
Citation
 Jaen, JCGregor, VELee, CDavis, REmmerling, M Acetylcholinesterase inhibition by fused dihydroquinazoline compounds Bioorg Med Chem Lett 6:737-742 (1996)    Article 
Target
Name:
Acetylcholinesterase
Synonyms:
ACES_HUMAN Acetylcholinesterase (AChE) | Acetylcholinesterase (human AChE)
Type:
Enzyme
Mol. Mass.:
67792.70
Organism:
Homo sapiens (Human)
Description:
P22303
Residue:
614
  
Inhibitor
Name:
BDBM50342601
Synonyms:
CHEMBL1255901 | Huperzine A
Type:
Small organic molecule
Emp. Form.:
C15H18N2O
Mol. Mass.:
242.3162
SMILES:
C\C=C1/[C@@H]2Cc3[nH]c(=O)ccc3[C@]1(N)CC(C)=C2
: