Target
D(2) dopamine receptor
Ligand
BDBM50290233
Substrate
Meas. Tech.
ChEBML_58455
Ki
5.6±n/a nM
Citation
 Belliotti, TRKesten, SRRubin, JRWustrow, DJGeorgic, LMZoski, KTAkunne, HCWise, LD Novel cyclohexyl amides as potent and selective D3 dopamine receptor ligands Bioorg Med Chem Lett 7:2403-2408 (1997)    Article 
Target
Name:
D(2) dopamine receptor
Synonyms:
D(2) dopamine receptor DOPAMINE D2 Long DRD2 Dopamine D2 receptor Dopamine D2 receptor (D2R) Dopamine2-like | d2
Type:
Cell-surface receptors
Mol. Mass.:
50647.10
Organism:
Homo sapiens (Human)
Description:
P14416
Residue:
443
  
Inhibitor
Name:
BDBM50290233
Synonyms:
CHEMBL80615 | Cyclohexanecarboxylic acid (4-{2-[4-(3,4-dimethyl-phenyl)-piperazin-1-yl]-ethyl}-cyclohexyl)-amide
Type:
Small organic molecule
Emp. Form.:
C27H43N3O
Mol. Mass.:
425.6498
SMILES:
Cc1ccc(cc1C)N1CCN(CC[C@H]2CC[C@@H](CC2)NC(=O)C2CCCCC2)CC1
: