Target
Prothrombin
Ligand
BDBM50291170
Substrate
Meas. Tech.
ChEBML_208134
IC50
2300±n/a nM
Citation
 Akiyama, YTsutsumi, SHatsushiba, EOhuchi, SOkonogi, T Peptidyl -keto thiazole as potent thrombin inhibitors Bioorg Med Chem Lett 7:533-538 (1997)    Article 
Target
Name:
Prothrombin
Synonyms:
Activation peptide fragment 1 Coagulation factor II Prothrombin precursor Thrombin heavy chain | Thrombin light chain
Type:
Protein
Mol. Mass.:
70029.57
Organism:
Homo sapiens (Human)
Description:
P00734
Residue:
622
  
Inhibitor
Name:
BDBM50291170
Synonyms:
(S)-1-((R)-2-Acetylamino-3-phenyl-propionyl)-pyrrolidine-2-carboxylic acid [(R)-4-guanidino-1-(thiazole-2-carbonyl)-butyl]-amide | CHEMBL149527
Type:
Small organic molecule
Emp. Form.:
C25H33N7O4S
Mol. Mass.:
527.639
SMILES:
CC(=O)N[C@H](Cc1ccccc1)C(=O)N1CCC[C@H]1C(=O)N[C@H](CCCNC(N)=N)C(=O)c1nccs1
: