Target
Neprilysin
Ligand
BDBM50291557
Substrate
Meas. Tech.
ChEBML_144318
IC50
1.5±n/a nM
Citation
 De Lombaert, SStamford, LBBlanchard, LTan, JHoyer, DDiefenbacher, CGWei, DWallace, EMMoskal, MASavage, PJeng, AY Potent non-peptidic dual inhibitors of endothelin-converting enzyme and neutral endopeptidase 24.11 Bioorg Med Chem Lett 7:1059-1064 (1997)    Article 
Target
Name:
Neprilysin
Synonyms:
Atriopeptidase CD_antigen=CD10 EPN MME NEP_HUMAN Neutral endopeptidase | Neutral endopeptidase 24.11
Type:
Enzyme
Mol. Mass.:
85505.38
Organism:
Homo sapiens (Human)
Description:
P08473
Residue:
750
  
Inhibitor
Name:
BDBM50291557
Synonyms:
CHEMBL268761 | {1-[(S)-2-Biphenyl-4-yl-1-(1H-tetrazol-5-yl)-ethylamino]-2-quinolin-8-yl-ethyl}-phosphonic acid
Type:
Small organic molecule
Emp. Form.:
C26H25N6O3P
Mol. Mass.:
500.4889
SMILES:
OP(O)(=O)C(Cc1cccc2cccnc12)N[C@@H](Cc1ccc(cc1)-c1ccccc1)c1nnn[nH]1
: