Target
Muscarinic acetylcholine receptor M1
Ligand
BDBM50450592
Substrate
Meas. Tech.
ChEBML_139961
Ki
0.150000±n/a nM
Citation
 Hudkins, RLDeHaven-Hudkins, DLDoukas, P Design of dual acting anticonvulsant-antimuscarinic succinimide and hydantoin derivatives Bioorg Med Chem Lett 7:979-984 (1997)    Article 
Target
Name:
Muscarinic acetylcholine receptor M1
Synonyms:
ACM1_RAT Chrm-1 cholinergic receptor, muscarinic 1
Type:
Enzyme Catalytic Domain
Mol. Mass.:
51390.46
Organism:
RAT
Description:
P08482
Residue:
460
  
Inhibitor
Name:
BDBM50450592
Synonyms:
CHEMBL558910
Type:
Small organic molecule
Emp. Form.:
C21H23NO3
Mol. Mass.:
337.4122
SMILES:
OC(C(=O)O[C@H]1CN2CCC1CC2)(c1ccccc1)c1ccccc1
: