Target
Neuromedin-K receptor
Ligand
BDBM50070351
Substrate
Meas. Tech.
ChEBML_142872
IC50
1.5±n/a nM
Citation
 Harrison, TKorsgaard, MPSwain, CJCascieri, MASadowski, SSeabrook, GR High affinity, selective neurokinin 2 and neurokinin 3 receptor antagonists from a common structural template. Bioorg Med Chem Lett 8:1343-8 (1999)  
Target
Name:
Neuromedin-K receptor
Synonyms:
NK-3 receptor NK3R NKR Neurokinin B receptor Neuromedin-3 receptor (NK-3R) Neuromedin-K receptor Neuromedin-K receptor (NK3) TAC3R Tachykinin receptor 3 | Tachykinin receptor 3 (NK3)
Type:
Enzyme
Mol. Mass.:
52221.96
Organism:
Homo sapiens (Human)
Description:
P29371
Residue:
465
  
Inhibitor
Name:
BDBM50070351
Synonyms:
1-(1-{3-[1-Benzoyl-3-(3,4-dichloro-phenyl)-piperidin-3-yl]-propyl}-4-phenyl-piperidin-4-yl)-ethanone | CHEMBL27463
Type:
Small organic molecule
Emp. Form.:
C34H38Cl2N2O2
Mol. Mass.:
577.584
SMILES:
CC(=O)C1(CCN(CCCC2(CCCN(C2)C(=O)c2ccccc2)c2ccc(Cl)c(Cl)c2)CC1)c1ccccc1
: