Target
Substance-P receptor
Ligand
BDBM50070367
Substrate
Meas. Tech.
ChEBML_142859
Ki
1.1±n/a nM
Citation
 Karoyan, PSagan, SClodic, GLavielle, SChassaing, G Asymmetric synthesis of Boc-N-methyl-p-benzoyl-phenylalanine. Preparation of a photoreactive antagonist of substance P. Bioorg Med Chem Lett 8:1369-74 (1999)  
Target
Name:
Substance-P receptor
Synonyms:
NK-1 receptor NK1 Receptor NK1R_HUMAN Neurokinin-1 (NK-1) SPR TACR1 Tachykinin receptor 1 (NK1) | tachykinin
Type:
G Protein-Coupled Receptor (GPCR)
Mol. Mass.:
46254.43
Organism:
Homo sapiens (Human)
Description:
P25103
Residue:
407
  
Inhibitor
Name:
BDBM50070367
Synonyms:
Arg-Pro-Lys-Pro-Gln-Gln-Phe-Phe-Pro-Leu-Met-NH2 | CHEMBL2372071
Type:
Small organic molecule
Emp. Form.:
C66H102N18O13S
Mol. Mass.:
1387.694
SMILES:
[#6]-[#16]-[#6]-[#6]-[#6@H](-[#7]-[#6](=O)-[#6@H](-[#6]-[#6](-[#6])-[#6])-[#7]-[#6](=O)-[#6@@H]-1-[#6]-[#6]-[#6]-[#7]-1-[#6](=O)-[#6@H](-[#6]-c1ccccc1)-[#7]-[#6](=O)-[#6@H](-[#6]-c1ccccc1)-[#7]-[#6](=O)-[#6@H](-[#6]-[#6]-[#6](-[#7])=O)-[#7]-[#6](=O)-[#6@H](-[#6]-[#6]-[#6](-[#7])=O)-[#7]-[#6](=O)-[#6@@H]-1-[#6]-[#6]-[#6]-[#7]-1-[#6](=O)-[#6@H](-[#6]-[#6]-[#6]-[#6]-[#7])-[#7]-[#6](=O)-[#6@@H]-1-[#6]-[#6]-[#6]-[#7]-1-[#6](=O)-[#6@@H](-[#7])-[#6]-[#6]-[#6]\[#7]=[#6](\[#7])-[#7])-[#6](-[#7])=O
: