Target
Metabotropic glutamate receptor 8
Ligand
BDBM50071155
Substrate
Meas. Tech.
ChEBML_104489
IC50
>300000±n/a nM
Citation
 Valli, MJSchoepp, DDWright, RAJohnson, BGKingston, AETomlinson, RMonn, JA Synthesis and metabotropic glutamate receptor antagonist activity of N1-substituted analogs of 2R,4R-4-aminopyrrolidine-2,4-dicarboxylic acid. Bioorg Med Chem Lett 8:1985-90 (1999)  
Target
Name:
Metabotropic glutamate receptor 8
Synonyms:
GPRC1H GRM8_HUMAN Metabotropic glutamate receptor 8 | metabotropic glutamate 8
Type:
Enzyme Catalytic Domain
Mol. Mass.:
101759.58
Organism:
Homo sapiens (Human)
Description:
metabotropic glutamate 8 GRM8 HUMAN::O00222
Residue:
908
  
Inhibitor
Name:
BDBM50071155
Synonyms:
(2R,4R)-4-Amino-1-naphthalen-2-ylmethyl-pyrrolidine-2,4-dicarboxylic acid | CHEMBL61281
Type:
Small organic molecule
Emp. Form.:
C17H18N2O4
Mol. Mass.:
314.3358
SMILES:
N[C@@]1(C[C@@H](N(Cc2ccc3ccccc3c2)C1)C(O)=O)C(O)=O
: