Target
Muscarinic acetylcholine receptor M1
Ligand
BDBM81462
Substrate
Meas. Tech.
ChEBML_139527
IC50
1.3±n/a nM
Citation
 Augelli-Szafran, CEJaen, JCMoreland, DWNelson, CBPenvose-Yi, JRSchwarz, RD Identification and characterization of m4 selective muscarinic antagonists. Bioorg Med Chem Lett 8:1991-6 (1999)  
Target
Name:
Muscarinic acetylcholine receptor M1
Synonyms:
ACM1_HUMAN Cholinergic receptor, muscarinic 1 | Cholinergic, muscarinic M1
Type:
Protein
Mol. Mass.:
51442.54
Organism:
Homo sapiens (Human)
Description:
P11229
Residue:
460
  
Inhibitor
Name:
BDBM81462
Synonyms:
(R)-Trihexyphenidyl Benzhexol NSC_5572 Trihexyphenidyl
Type:
Small organic molecule
Emp. Form.:
C20H31NO
Mol. Mass.:
301.4662
SMILES:
OC(CCN1CCCCC1)(C1CCCCC1)c1ccccc1
: