Target
Mu-type opioid receptor
Ligand
BDBM50450653
Substrate
Meas. Tech.
ChEBML_139014
IC50
0.250000±n/a nM
Citation
 Horikawa, MShigeri, YYumoto, NYoshikawa, SNakajima, TOhfune, Y Syntheses of potent Leu-enkephalin analogs possessing beta-hydroxy-alpha,alpha-disubstituted-alpha-amino acid and their characterization to opioid receptors. Bioorg Med Chem Lett 8:2027-32 (1999)  
Target
Name:
Mu-type opioid receptor
Synonyms:
MOR-1 Mu-type opioid receptor (MOR) OPRM_RAT Opioid receptor B Ror-b
Type:
G Protein-Coupled Receptor (GPCR)
Mol. Mass.:
44503.11
Organism:
Rattus norvegicus (rat)
Description:
Competition binding assays were carried out using membrane preparations from transfected HN9.10 cells that constitutively expressed the mu opioid receptor.
Residue:
398
  
Inhibitor
Name:
BDBM50450653
Synonyms:
CHEMBL2115493
Type:
Small organic molecule
Emp. Form.:
C33H45N5O8
Mol. Mass.:
639.7391
SMILES:
CC(C)C[C@@H](NC(=O)[C@@H](Cc1ccccc1)NC(=O)CNC(=O)[C@]1(CCCC[C@@H]1O)NC(=O)[C@H](N)Cc1ccc(O)cc1)C(O)=O
: