Target
Delta-type opioid receptor
Ligand
BDBM50071199
Substrate
Meas. Tech.
ChEBML_146650
IC50
50±n/a nM
Citation
 Horikawa, MShigeri, YYumoto, NYoshikawa, SNakajima, TOhfune, Y Syntheses of potent Leu-enkephalin analogs possessing beta-hydroxy-alpha,alpha-disubstituted-alpha-amino acid and their characterization to opioid receptors. Bioorg Med Chem Lett 8:2027-32 (1999)  
Target
Name:
Delta-type opioid receptor
Synonyms:
Cytochrome P450 3A4 Delta opioid receptor Delta-type opioid receptor (DOR) OPRD_RAT Opioid receptor Opioid receptors; mu & delta Ror-a | Voltage-gated potassium channel
Type:
G Protein-Coupled Receptor (GPCR)
Mol. Mass.:
40465.04
Organism:
Rattus norvegicus (rat)
Description:
Competition binding assays were using CHO-K1 cell membranes expressing the opioid receptor.
Residue:
372
  
Inhibitor
Name:
BDBM50071199
Synonyms:
(R)-2-[(R)-2-(2-{2-[(R)-2-Amino-3-(4-hydroxy-phenyl)-propionylamino]-2-methyl-propionylamino}-acetylamino)-3-phenyl-propionylamino]-4-methyl-pentanoic acid | CHEMBL2373084
Type:
Small organic molecule
Emp. Form.:
C30H41N5O7
Mol. Mass.:
583.6758
SMILES:
CC(C)C[C@H](NC(=O)[C@H](Cc1ccccc1)NC(=O)CNC(=O)C(C)(C)NC(=O)[C@@H](N)Cc1ccc(O)cc1)C(O)=O
: