Target
D(2) dopamine receptor
Ligand
BDBM50071218
Substrate
Meas. Tech.
ChEBML_59914
IC50
70±n/a nM
Citation
 Arlt, MBöttcher, HRiethmüller, ASchneider, GBartoszyk, GDGreiner, HSeyfried, CA SAR of novel biarylmethylamine dopamine D4 receptor ligands. Bioorg Med Chem Lett 8:2033-8 (1999)  
Target
Name:
D(2) dopamine receptor
Synonyms:
D(2) dopamine receptor DOPAMINE D2 Long DRD2 Dopamine D2 receptor Dopamine D2 receptor (D2R) Dopamine2-like | d2
Type:
Cell-surface receptors
Mol. Mass.:
50647.10
Organism:
Homo sapiens (Human)
Description:
P14416
Residue:
443
  
Inhibitor
Name:
BDBM50071218
Synonyms:
1-(4-Fluoro-phenyl)-4-[5-(4-fluoro-phenyl)-pyridin-3-ylmethyl]-piperazine | CHEMBL291824
Type:
Small organic molecule
Emp. Form.:
C22H21F2N3
Mol. Mass.:
365.419
SMILES:
Fc1ccc(cc1)N1CCN(Cc2cncc(c2)-c2ccc(F)cc2)CC1
: