Target
Cathepsin D
Ligand
BDBM50071549
Substrate
Meas. Tech.
ChEMBL_45324 (CHEMBL661012)
Ki
6200±n/a nM
Citation
 Carroll, CDPatel, HJohnson, TOGuo, TOrlowski, MHe, ZMCavallaro, CLGuo, JOksman, AGluzman, IYConnelly, JChelsky, DGoldberg, DEDolle, RE Identification of potent inhibitors of Plasmodium falciparum plasmepsin II from an encoded statine combinatorial library. Bioorg Med Chem Lett 8:2315-20 (1999)  
Target
Name:
Cathepsin D
Synonyms:
CATD_HUMAN CTSD Cathepsin D heavy chain Cathepsin D precursor
Type:
Enzyme
Mol. Mass.:
44551.72
Organism:
Homo sapiens (Human)
Description:
Human proCathepsin D (SwissProt accession number P07339) was expressed in Sf9 cells, purified, and autoactivated.
Residue:
412
  
Inhibitor
Name:
BDBM50071549
Synonyms:
CHEMBL309056 PS-154636-1 | PS-154636-2
Type:
Small organic molecule
Emp. Form.:
C32H39N3O6
Mol. Mass.:
561.6686
SMILES:
CCCCNC(=O)CC(O)C(Cc1ccccc1)NC(=O)[C@@H](NC(=O)c1ccc(OC)cc1OC)c1ccccc1
: