Target
Gastrin-releasing peptide receptor
Ligand
BDBM50071732
Substrate
Meas. Tech.
ChEBML_39763
Ki
1254±n/a nM
Citation
 Ashwood, VBrownhill, VHigginbottom, MHorwell, DCHughes, JLewthwaite, RAMcKnight, ATPinnock, RDPritchard, MCSuman-Chauhan, NWebb, CWilliams, SC PD 176252--the first high affinity non-peptide gastrin-releasing peptide (BB2) receptor antagonist. Bioorg Med Chem Lett 8:2589-94 (1999)  
Target
Name:
Gastrin-releasing peptide receptor
Synonyms:
Bombesin 2 GRP-preferring bombesin receptor GRPR_HUMAN Gastrin-releasing peptide receptor
Type:
Enzyme Catalytic Domain
Mol. Mass.:
43214.53
Organism:
Homo sapiens (Human)
Description:
Bombesin 2 GRPR 0::P30550
Residue:
384
  
Inhibitor
Name:
BDBM50071732
Synonyms:
(S)-3-(1H-Indol-3-yl)-2-methyl-2-[3-(2-nitro-phenyl)-ureido]-N-(1-pyridin-2-yl-cyclohexylmethyl)-propionamide | CHEMBL89813
Type:
Small organic molecule
Emp. Form.:
C31H34N6O4
Mol. Mass.:
554.6395
SMILES:
C[C@@](Cc1c[nH]c2ccccc12)(NC(=O)Nc1ccccc1[N+]([O-])=O)C(=O)NCC1(CCCCC1)c1ccccn1
: