Target
Neuromedin-B receptor
Ligand
BDBM50071740
Substrate
Meas. Tech.
ChEBML_39622
Ki
2.8±n/a nM
Citation
 Ashwood, VBrownhill, VHigginbottom, MHorwell, DCHughes, JLewthwaite, RAMcKnight, ATPinnock, RDPritchard, MCSuman-Chauhan, NWebb, CWilliams, SC PD 176252--the first high affinity non-peptide gastrin-releasing peptide (BB2) receptor antagonist. Bioorg Med Chem Lett 8:2589-94 (1999)  
Target
Name:
Neuromedin-B receptor
Synonyms:
Bombesin 1 NMBR Neuromedin B Neuromedin-B receptor | Neuromedin-B-preferring bombesin receptor
Type:
Enzyme Catalytic Domain
Mol. Mass.:
43447.11
Organism:
Homo sapiens (Human)
Description:
Bombesin 1 NMBR 0::P28336
Residue:
390
  
Inhibitor
Name:
BDBM50071740
Synonyms:
(S)-2-[3-(4-Chloro-phenyl)-ureido]-3-(1H-indol-3-yl)-2-methyl-N-(1-pyridin-2-yl-cyclohexylmethyl)-propionamide | CHEMBL316085
Type:
Small organic molecule
Emp. Form.:
C31H34ClN5O2
Mol. Mass.:
544.087
SMILES:
C[C@@](Cc1c[nH]c2ccccc12)(NC(=O)Nc1ccc(Cl)cc1)C(=O)NCC1(CCCCC1)c1ccccn1
: