Target
Muscarinic acetylcholine receptor M2
Ligand
BDBM50072228
Substrate
Meas. Tech.
ChEBML_139656
EC50
62±n/a nM
Citation
 Sauerberg, PJeppesen, LOlesen, PHSheardown, MJFink-Jensen, ARasmussen, TRimvall, KShannon, HEBymaster, FPDeLapp, NWCalligaro, DOWard, JSWhitesitt, CAThomsen, C Identification of side chains on 1,2,5-thiadiazole-azacycles optimal for muscarinic m1 receptor activation. Bioorg Med Chem Lett 8:2897-902 (1999)  
Target
Name:
Muscarinic acetylcholine receptor M2
Synonyms:
ACM2_HUMAN Cholinergic, muscarinic M2 Muscarinic acetylcholine receptor M2 and M5 | RecName: Full=Muscarinic acetylcholine receptor M2
Type:
GPCR
Mol. Mass.:
51730.61
Organism:
Homo sapiens (Human)
Description:
P08172
Residue:
466
  
Inhibitor
Name:
BDBM50072228
Synonyms:
3-[4-(3-Phenyl-prop-2-ynyloxy)-[1,2,5]thiadiazol-3-yl]-1-aza-bicyclo[2.2.2]octane NNC 11-1314
Type:
Small organic molecule
Emp. Form.:
C18H19N3OS
Mol. Mass.:
325.428
SMILES:
C(Oc1nsnc1C1CN2CCC1CC2)C#Cc1ccccc1
: