Target
Glyceraldehyde-3-phosphate dehydrogenase
Ligand
BDBM50366559
Substrate
Meas. Tech.
ChEBML_72905
Ki
1500000±n/a nM
Citation
 Aronov, AMGelb, MH Synthesis and structure-activity relationships of adenosine analogs as inhibitors of trypanosomal glyceraldehyde-3-phosphate dehydrogenase. Modifications at positions 5' and 8. Bioorg Med Chem Lett 8:3505-10 (1999)  
Target
Name:
Glyceraldehyde-3-phosphate dehydrogenase
Synonyms:
G3P_HUMAN GAPDH | Glyceraldehyde-3-phosphate dehydrogenase liver
Type:
PROTEIN
Mol. Mass.:
36060.86
Organism:
Homo sapiens (Human)
Description:
ChEMBL_1511315
Residue:
335
  
Inhibitor
Name:
BDBM50366559
Synonyms:
CHEMBL608637
Type:
Small organic molecule
Emp. Form.:
C13H20N6O4
Mol. Mass.:
324.3357
SMILES:
CC(C)Nc1nc2c(N)ncnc2n1C1O[C@H](CO)[C@@H](O)[C@H]1O
: