Target
Sodium-dependent dopamine transporter
Ligand
BDBM50073433
Substrate
Meas. Tech.
ChEBML_62153
IC50
1.96±n/a nM
Citation
 Jiang, SChang, ACAbraham, PKuhar, MJCarroll, FI Synthesis and transporter binding properties of (R)-2 beta, 3 beta- and (R)-2 alpha, 3 alpha-diaryltropanes. Bioorg Med Chem Lett 8:3689-92 (1999)  
Target
Name:
Sodium-dependent dopamine transporter
Synonyms:
DA transporter SC6A3_RAT Sodium-dependent dopamine transporter | Sodium-dependent dopamine transporter (DAT)
Type:
Multi-pass membrane protein
Mol. Mass.:
68749.45
Organism:
Rattus norvegicus (rat)
Description:
P23977
Residue:
619
  
Inhibitor
Name:
BDBM50073433
Synonyms:
(R)-8-Methyl-2-phenyl-3-p-tolyl-8-aza-bicyclo[3.2.1]octane | CHEMBL123058
Type:
Small organic molecule
Emp. Form.:
C21H25N
Mol. Mass.:
291.4299
SMILES:
CN1[C@@H]2CCC1C(C(C2)c1ccc(C)cc1)c1ccccc1
: