Target
Transporter
Ligand
BDBM50073434
Substrate
Meas. Tech.
ChEBML_142962
IC50
690±n/a nM
Citation
 Jiang, SChang, ACAbraham, PKuhar, MJCarroll, FI Synthesis and transporter binding properties of (R)-2 beta, 3 beta- and (R)-2 alpha, 3 alpha-diaryltropanes. Bioorg Med Chem Lett 8:3689-92 (1999)  
Target
Name:
Transporter
Synonyms:
Monoamine transporters; Norepininephrine & dopamine | Norepinephrine Monoamine transporters
Type:
PROTEIN
Mol. Mass.:
66787.87
Organism:
Rattus norvegicus
Description:
ChEMBL_1463061
Residue:
597
  
Inhibitor
Name:
BDBM50073434
Synonyms:
(R)-8-Methyl-2,3-diphenyl-8-aza-bicyclo[3.2.1]octane | CHEMBL3084336
Type:
Small organic molecule
Emp. Form.:
C20H23N
Mol. Mass.:
277.4033
SMILES:
[H][C@@]12CC[C@@]([H])([C@H]([C@@H](C1)c1ccccc1)c1ccccc1)N2C
: