Target
Tyrosine-protein phosphatase non-receptor type 1
Ligand
BDBM50070001
Substrate
Meas. Tech.
ChEBML_162099
Ki
255000±n/a nM
Citation
 Wang, QHuang, ZRamachandran, CDinaut, ANTaylor, SD Naphthalenebis[alpha,alpha-difluoromethylenephosphonates] as potent inhibitors of protein tyrosine phosphatases. Bioorg Med Chem Lett 8:345-50 (1999)  
Target
Name:
Tyrosine-protein phosphatase non-receptor type 1
Synonyms:
PTN1_HUMAN PTPN1 Protein tyrosine phosphatase-1B (PTP1B) Protein-tyrosine phosphatase 1B (PTP1B) Tyrosine-protein phosphatase non-receptor type 1 (PTP1B)
Type:
Protein phosphatase
Mol. Mass.:
49963.76
Organism:
Homo sapiens (Human)
Description:
Human recombinant GST-fusion PTP1B (1-435).
Residue:
435
  
Inhibitor
Name:
BDBM50070001
Synonyms:
difluoro(1-naphthyl)methylphosphonate
Type:
Small organic molecule
Emp. Form.:
C11H7F2O3P
Mol. Mass.:
256.1431
SMILES:
[O-]P([O-])(=O)C(F)(F)c1cccc2ccccc12
: