Target
Sodium-dependent serotonin transporter
Ligand
BDBM50069444
Substrate
Meas. Tech.
ChEBML_201359
Kd
118±n/a nM
Citation
 Carlier, PRLo, MMLo, PCRichelson, ETatsumi, MReynolds, IJSharma, TA Synthesis of a potent wide-spectrum serotonin-, norepinephrine-, dopamine-reuptake inhibitor (SNDRI) and a species-selective dopamine-reuptake inhibitor based on the gamma-amino alcohol functional group. Bioorg Med Chem Lett 8:487-92 (1999)  
Target
Name:
Sodium-dependent serotonin transporter
Synonyms:
5-HT Transporter 5HTT SC6A4_HUMAN SLC6A4 Serotonin transporter (5HTT) Sodium-dependent serotonin transporter (SERT) | Solute carrier family 6 member 4
Type:
Multi-pass membrane protein
Mol. Mass.:
70322.51
Organism:
Homo sapiens (Human)
Description:
P31645
Residue:
630
  
Inhibitor
Name:
BDBM50069444
Synonyms:
(1R,2R)-3-Amino-2-phenyl-1-(2,4,6-trimethyl-phenyl)-propan-1-ol; hydrochloride | CHEMBL539054
Type:
Small organic molecule
Emp. Form.:
C18H23NO
Mol. Mass.:
269.3813
SMILES:
Cc1cc(C)c([C@H](O)[C@@H](CN)c2ccccc2)c(C)c1
: