Target
Glutamate receptor ionotropic, NMDA 1
Ligand
BDBM50069486
Substrate
Meas. Tech.
ChEBML_140302
IC50
20000±n/a nM
Citation
 Acklin, PAllgeier, HAuberson, YPBischoff, SOfner, SSauer, DSchmutz, M 5-Aminomethylquinoxaline-2,3-diones, Part III: Arylamide derivatives as highly potent and selective glycine-site NMDA receptor antagonists. Bioorg Med Chem Lett 8:493-8 (1999)  
Target
Name:
Glutamate receptor ionotropic, NMDA 1
Synonyms:
Glutamate (NMDA) receptor subunit zeta 1 Glutamate-NMDA-Channel Glutamate-NMDA-Polyamine NMDA Nmdar1 | phencyclidine
Type:
Enzyme Catalytic Domain
Mol. Mass.:
105533.40
Organism:
RAT
Description:
P35439
Residue:
938
  
Inhibitor
Name:
BDBM50069486
Synonyms:
CHEMBL343893 | N-(7-Bromo-2,3-dioxo-1,2,3,4-tetrahydro-quinoxalin-5-ylmethyl)-2-(4-chloro-phenyl)-acetamide
Type:
Small organic molecule
Emp. Form.:
C17H13BrClN3O3
Mol. Mass.:
422.66
SMILES:
Clc1ccc(CC(=O)NCc2cc(Br)cc3[nH]c(=O)c(=O)[nH]c23)cc1
: