Target
Cyclin-dependent kinase 1
Ligand
BDBM50073796
Substrate
Meas. Tech.
ChEBML_50317
IC50
30±n/a nM
Citation
 Imbach, PCapraro, HGFuret, PMett, HMeyer, TZimmermann, J 2,6,9-trisubstituted purines: optimization towards highly potent and selective CDK1 inhibitors. Bioorg Med Chem Lett 9:91-6 (1999)  
Target
Name:
Cyclin-dependent kinase 1
Synonyms:
CDC2 CDK1 CDKN1 Cell division protein kinase 1 P34CDC2 | p34 protein kinase
Type:
Enzyme Subunit
Mol. Mass.:
34101.08
Organism:
Homo sapiens (Human)
Description:
P06493
Residue:
297
  
Inhibitor
Name:
BDBM50073796
Synonyms:
4-[6-(3-Chloro-phenylamino)-9-ethyl-9H-purin-2-ylamino]-cyclohexanol | CHEMBL177138
Type:
Small organic molecule
Emp. Form.:
C19H23ClN6O
Mol. Mass.:
386.879
SMILES:
CCn1cnc2c(Nc3cccc(Cl)c3)nc(N[C@H]3CC[C@H](O)CC3)nc12
: