Target
Cyclin-dependent kinase 1
Ligand
BDBM50073759
Substrate
Meas. Tech.
ChEBML_50317
IC50
39.0±n/a nM
Citation
 Imbach, PCapraro, HGFuret, PMett, HMeyer, TZimmermann, J 2,6,9-trisubstituted purines: optimization towards highly potent and selective CDK1 inhibitors. Bioorg Med Chem Lett 9:91-6 (1999)  
Target
Name:
Cyclin-dependent kinase 1
Synonyms:
CDC2 CDK1 CDKN1 Cell division protein kinase 1 P34CDC2 | p34 protein kinase
Type:
Enzyme Subunit
Mol. Mass.:
34101.08
Organism:
Homo sapiens (Human)
Description:
P06493
Residue:
297
  
Inhibitor
Name:
BDBM50073759
Synonyms:
CHEMBL173459 | N*2*-(4-Amino-cyclohexyl)-N*6*-(3-chloro-phenyl)-9-ethyl-9H-purine-2,6-diamine
Type:
Small organic molecule
Emp. Form.:
C19H24ClN7
Mol. Mass.:
385.894
SMILES:
CCn1cnc2c(Nc3cccc(Cl)c3)nc(N[C@@H]3CC[C@H](N)CC3)nc12
: