Target
Protein farnesyltransferase subunit beta/geranylgeranyltransferase type-1 subunit alpha
Ligand
BDBM50079786
Substrate
Meas. Tech.
ChEMBL_70277 (CHEMBL681416)
IC50
20±n/a nM
Citation
 O'Connell, CEAckermann, KRowell, CAGarcia, AMLewis, MDSchwartz, CE Synthesis and evaluation of hydroxyproline-derived isoprenyltransferase inhibitors. Bioorg Med Chem Lett 9:2095-100 (1999)  
Target
Name:
Protein farnesyltransferase subunit beta/geranylgeranyltransferase type-1 subunit alpha
Synonyms:
Protein Farnesyltransferase (PFT) | Protein farnesyltransferase
Type:
Protein Complex
Mol. Mass.:
Description:
Purified bovine brain FTase.
Components:
This complex has 2 components.
Component 1
Name:
Protein farnesyltransferase/geranylgeranyltransferase type-1 subunit alpha
Synonyms:
CAAX farnesyltransferase alpha subunit FNTA_BOVIN GGTase-I-alpha Protein Farnesyltransferase (PFT) Chain A Protein farnesyltransferase/geranylgeranyltransferase type I alpha subunit Type I protein geranyl-geranyltransferase alpha subunit
Type:
Enzyme
Mol. Mass.:
43827.38
Organism:
Bos taurus (bovine)
Description:
The enzyme was purified from a bovine brain homogenate by sequential ammonium sulfate fractionation and affinity chromatography.
Residue:
375
  
Component 2
Name:
Protein farnesyltransferase subunit beta
Synonyms:
CAAX farnesyltransferase subunit beta FNTB_BOVIN Protein farnesyltransferase Protein farnesyltransferase subunit beta Ras proteins prenyltransferase subunit beta
Type:
Enzyme Subunit
Mol. Mass.:
48758.49
Organism:
Bos taurus (bovine)
Description:
Protein farnesyltransferase subunit beta
Residue:
437
  
Inhibitor
Name:
BDBM50079786
Synonyms:
2-[1-[5-amino-6-sulfanyl-(5R)-hexyl]-4-phenoxy-(2S,4S)-tetrahydro-1H-2-pyrrolylcarboxamido]-4-methylsulfanyl-(2S)-butanoic acid with di( TFA) | CHEMBL303509
Type:
Small organic molecule
Emp. Form.:
C22H35N3O4S2
Mol. Mass.:
469.661
SMILES:
CSCC[C@H](NC(=O)[C@@H]1C[C@@H](CN1CCCC[C@@H](N)CS)Oc1ccccc1)C(O)=O
: