Target
Geranylgeranyl transferase type-1 subunit beta/Protein farnesyltransferase/geranylgeranyltransferase type-1 subunit alpha
Ligand
BDBM50079811
Substrate
Meas. Tech.
ChEMBL_71680 (CHEMBL681672)
IC50
210±n/a nM
Citation
 O'Connell, CEAckermann, KRowell, CAGarcia, AMLewis, MDSchwartz, CE Synthesis and evaluation of hydroxyproline-derived isoprenyltransferase inhibitors. Bioorg Med Chem Lett 9:2095-100 (1999)  
Target
Name:
Geranylgeranyl transferase type-1 subunit beta/Protein farnesyltransferase/geranylgeranyltransferase type-1 subunit alpha
Synonyms:
Geranylgeranyl Transferase (GGTase-I) Geranylgeranyl transferase type I
Type:
Protein Complex
Mol. Mass.:
Description:
Components:
This complex has 2 components.
Component 1
Name:
Protein farnesyltransferase/geranylgeranyltransferase type-1 subunit alpha
Synonyms:
CAAX farnesyltransferase alpha subunit FNTA_BOVIN GGTase-I-alpha Protein Farnesyltransferase (PFT) Chain A Protein farnesyltransferase/geranylgeranyltransferase type I alpha subunit Type I protein geranyl-geranyltransferase alpha subunit
Type:
Enzyme
Mol. Mass.:
43827.38
Organism:
Bos taurus (bovine)
Description:
The enzyme was purified from a bovine brain homogenate by sequential ammonium sulfate fractionation and affinity chromatography.
Residue:
375
  
Component 2
Name:
Geranylgeranyl transferase type-1 subunit beta
Synonyms:
GGTase-I-beta Geranylgeranyl transferase type-1 subunit beta PGTB1_BOVIN | Type I protein geranyl-geranyltransferase subunit beta
Type:
Enzyme
Mol. Mass.:
42483.88
Organism:
Bos taurus (bovine)
Description:
Purified from bovine brain
Residue:
377
  
Inhibitor
Name:
BDBM50079811
Synonyms:
2-[1-[4-amino-5-sulfanyl-(E,4R)-2-pentenyl]-4-(4-isopropylphenoxy)-(2S,4S)-tetrahydro-1H-2-pyrrolylcarboxamido]-4-methylsulfanyl-(2S)-butanoic acid with di( TFA) | CHEMBL67174
Type:
Small organic molecule
Emp. Form.:
C24H37N3O4S2
Mol. Mass.:
495.698
SMILES:
CSCC[C@H](NC(=O)[C@@H]1C[C@@H](CN1C\C=C\[C@@H](N)CS)Oc1ccc(cc1)C(C)C)C(O)=O
: