Target
Protein farnesyltransferase subunit beta/geranylgeranyltransferase type-1 subunit alpha
Ligand
BDBM50366603
Substrate
Meas. Tech.
ChEMBL_70277 (CHEMBL681416)
IC50
450±n/a nM
Citation
 O'Connell, CEAckermann, KRowell, CAGarcia, AMLewis, MDSchwartz, CE Synthesis and evaluation of hydroxyproline-derived isoprenyltransferase inhibitors. Bioorg Med Chem Lett 9:2095-100 (1999)  
Target
Name:
Protein farnesyltransferase subunit beta/geranylgeranyltransferase type-1 subunit alpha
Synonyms:
Protein Farnesyltransferase (PFT) | Protein farnesyltransferase
Type:
Protein Complex
Mol. Mass.:
Description:
Purified bovine brain FTase.
Components:
This complex has 2 components.
Component 1
Name:
Protein farnesyltransferase/geranylgeranyltransferase type-1 subunit alpha
Synonyms:
CAAX farnesyltransferase alpha subunit FNTA_BOVIN GGTase-I-alpha Protein Farnesyltransferase (PFT) Chain A Protein farnesyltransferase/geranylgeranyltransferase type I alpha subunit Type I protein geranyl-geranyltransferase alpha subunit
Type:
Enzyme
Mol. Mass.:
43827.38
Organism:
Bos taurus (bovine)
Description:
The enzyme was purified from a bovine brain homogenate by sequential ammonium sulfate fractionation and affinity chromatography.
Residue:
375
  
Component 2
Name:
Protein farnesyltransferase subunit beta
Synonyms:
CAAX farnesyltransferase subunit beta FNTB_BOVIN Protein farnesyltransferase Protein farnesyltransferase subunit beta Ras proteins prenyltransferase subunit beta
Type:
Enzyme Subunit
Mol. Mass.:
48758.49
Organism:
Bos taurus (bovine)
Description:
Protein farnesyltransferase subunit beta
Residue:
437
  
Inhibitor
Name:
BDBM50366603
Synonyms:
CHEMBL1793799 | CHEMBL3349310
Type:
Small organic molecule
Emp. Form.:
C27H37F6N3O10S2
Mol. Mass.:
741.717
SMILES:
OC(=O)C(F)(F)F.OC(=O)C(F)(F)F.[H][C@](N)(CS)\C=C\CN1C[C@]([H])(C[C@]1([H])C(=O)N[C@]([H])(CCSC)C(O)=O)Oc1ccc(OC)c(OC)c1
: