Target
Sigma non-opioid intracellular receptor 1
Ligand
BDBM50031299
Substrate
Meas. Tech.
ChEBML_149641
IC50
>10000±n/a nM
Citation
 Pevarello, PBonsignori, ACaccia, CAmici, RMcArthur, RAFariello, RGSalvati, PVarasi, M Sodium channel activity and sigma binding of 2-aminopropanamide anticonvulsants. Bioorg Med Chem Lett 9:2521-4 (1999)  
Target
Name:
Sigma non-opioid intracellular receptor 1
Synonyms:
Opioid receptor SGMR1_RAT Sigma non-opioid intracellular receptor 1 Sigma-1 | Sigmar1
Type:
Enzyme Catalytic Domain
Mol. Mass.:
25266.54
Organism:
RAT
Description:
Q9R0C9
Residue:
223
  
Inhibitor
Name:
BDBM50031299
Synonyms:
6-(2,3-Dichloro-phenyl)-[1,2,4]triazine-3,5-diamine 6-(2,3-dichlorophenyl)-1,2,4-triazine-3,5-diamine CHEMBL741 Lamictal | Lamictal cd
Type:
Small organic molecule
Emp. Form.:
C9H7Cl2N5
Mol. Mass.:
256.091
SMILES:
Nc1nnc(c(N)n1)-c1cccc(Cl)c1Cl
: