Target
Prothrombin
Ligand
BDBM50037996
Substrate
Meas. Tech.
ChEMBL_208880 (CHEMBL814938)
IC50
690±n/a nM
Citation
 Smit, MJ Design, synthesis and testing of amino-bicycloaryl based orally bioavailable thrombin inhibitors. Bioorg Med Chem Lett 9:2837-42 (1999)  
Target
Name:
Prothrombin
Synonyms:
Activation peptide fragment 1 Coagulation factor II Prothrombin precursor Thrombin heavy chain | Thrombin light chain
Type:
Protein
Mol. Mass.:
70029.57
Organism:
Homo sapiens (Human)
Description:
P00734
Residue:
622
  
Inhibitor
Name:
BDBM50037996
Synonyms:
1-[N-(naphthalen-2-ylsulfonyl)glycyl-4-carbamimidoyl-D-phenylalanyl]piperidine N-[(R)-1-(4-Carbamimidoyl-benzyl)-2-oxo-2-piperidin-1-yl-ethyl]-2-(naphthalene-2-sulfonylamino)-acetamide N-[1-(4-Carbamimidoyl-benzyl)-2-oxo-2-piperidin-1-yl-ethyl]-2-(naphthalene-2-sulfonylamino)-acetamide | N-[1-(4-Carbamimidoyl-benzyl)-2-oxo-2-piperidin-1-yl-ethyl]-2-(naphthalene-2-sulfonylamino)-acetamide(NAPAP)
Type:
Small organic molecule
Emp. Form.:
C27H31N5O4S
Mol. Mass.:
521.631
SMILES:
NC(=N)c1ccc(C[C@@H](NC(=O)CNS(=O)(=O)c2ccc3ccccc3c2)C(=O)N2CCCCC2)cc1
: