Target
Mu-type opioid receptor
Ligand
BDBM50082339
Substrate
Meas. Tech.
ChEMBL_138731 (CHEMBL747753)
Kd
4667±n/a nM
Citation
 Thomas, JBHerault, XMRothman, RBBurgess, JPMascarella, SWXu, HHorel, RBDersch, CMCarroll, FI (+/-)-4-[(N-allyl-cis-3-methyl-4-piperidinyl)phenylamino]-N,N-diethylbenzamide displays selective binding for the delta opioid receptor. Bioorg Med Chem Lett 9:3053-6 (1999)  
Target
Name:
Mu-type opioid receptor
Synonyms:
M-OR-1 Mu opioid receptor OPIATE Mu OPRM_CAVPO
Type:
Enzyme Catalytic Domain
Mol. Mass.:
11165.58
Organism:
GUINEA PIG
Description:
P97266
Residue:
98
  
Inhibitor
Name:
BDBM50082339
Synonyms:
4-[((S)-1-Allyl-3-methyl-piperidin-4-yl)-phenyl-amino]-N,N-diethyl-benzamide | CHEMBL430475
Type:
Small organic molecule
Emp. Form.:
C26H35N3O
Mol. Mass.:
405.5756
SMILES:
CCN(CC)C(=O)c1ccc(cc1)N([C@H]1CCN(CC=C)CC1C)c1ccccc1
: