Target
5-hydroxytryptamine receptor 1A
Ligand
BDBM50082408
Substrate
Meas. Tech.
ChEMBL_941 (CHEMBL616120)
Ki
2.2±n/a nM
Citation
 van Niel, MBBeer, MSCastro, JLCheng, SKEvans, DCHeald, AHitzel, LHunt, PMortishire-Smith, RO'Connor, DWatt, APMacLeod, AM Parallel synthesis of 3-aryloxy-2-propanolamines and evaluation as dual affinity 5-HT(1A) and 5-HT re-uptake ligands. Bioorg Med Chem Lett 9:3243-8 (1999)  
Target
Name:
5-hydroxytryptamine receptor 1A
Synonyms:
5-HT-1A 5-hydroxytryptamine receptor 1A (5-HT-1A) ADRB2RL1 Dopamine D2 receptor and serotonin 1a receptor HTR1A | Serotonin receptor 1A
Type:
Mol. Mass.:
46122.49
Organism:
Homo sapiens (Human)
Description:
Residue:
422
  
Inhibitor
Name:
BDBM50082408
Synonyms:
1-benzyloxy-3-spiro[1,3-dihydrobenzo[e]isobenzofuran-3,4'-(hexahydropyridine)]-1-yl-2-propanol | CHEMBL114452
Type:
Small organic molecule
Emp. Form.:
C26H29NO3
Mol. Mass.:
403.5134
SMILES:
OC(COCc1ccccc1)CN1CCC2(CC1)OCc1c2ccc2ccccc12
: