Target
Oxytocin receptor
Ligand
BDBM50205990
Substrate
Meas. Tech.
ChEBML_149040
Kd
6.7±n/a nM
Citation
 Tóth, GKBakos, KPenke, BPávó, IVarga, CTörök, GPéter, AFülöp, F Synthesis of oxytocin antagonists containing conformationally constrained amino acids in position 2. Bioorg Med Chem Lett 9:667-72 (1999)  
Target
Name:
Oxytocin receptor
Synonyms:
OT-R OXYR_HUMAN | Oxytocin
Type:
Enzyme Catalytic Domain
Mol. Mass.:
42793.26
Organism:
Homo sapiens (Human)
Description:
Oxytocin OXTR HEK293::B2R9L7
Residue:
389
  
Inhibitor
Name:
BDBM50205990
Synonyms:
CHEMBL395429 | OXYTOCIN
Type:
Small organic molecule
Emp. Form.:
C43H66N12O12S2
Mol. Mass.:
1007.187
SMILES:
CC[C@H](C)[C@@H]1NC(=O)[C@H](Cc2ccc(O)cc2)NC(=O)[C@@H](N)CSSC[C@H](NC(=O)[C@H](CC(N)=O)NC(=O)[C@H](CCC(N)=O)NC1=O)C(=O)N1CCC[C@H]1C(=O)N[C@@H](CC(C)C)C(=O)NCC(N)=O
: