Target
D(4) dopamine receptor
Ligand
BDBM50076025
Substrate
Meas. Tech.
ChEBML_61184
Ki
130±n/a nM
Citation
 Thomas, CHübner, HGmeiner, P Enantio- and diastereocontrolled dopamine D1, D2, D3 and D4 receptor binding of N-(3-pyrrolidinylmethyl)benzamides synthesized from aspartic acid. Bioorg Med Chem Lett 9:841-6 (1999)  
Target
Name:
D(4) dopamine receptor
Synonyms:
D(2C) dopamine receptor DOPAMINE D4.2 DRD4 Dopamine D4 receptor
Type:
Enzyme
Mol. Mass.:
48373.19
Organism:
Homo sapiens (Human)
Description:
P21917
Residue:
419
  
Inhibitor
Name:
BDBM50076025
Synonyms:
CHEMBL168544 | N-((3R,4S)-1-Benzyl-4-propyl-pyrrolidin-3-ylmethyl)-5-chloro-2-methoxy-4-methylamino-benzamide
Type:
Small organic molecule
Emp. Form.:
C24H32ClN3O2
Mol. Mass.:
429.983
SMILES:
CCC[C@@H]1CN(Cc2ccccc2)C[C@H]1CNC(=O)c1cc(Cl)c(NC)cc1OC
: