Target
Androgen receptor
Ligand
BDBM50077112
Substrate
Meas. Tech.
ChEMBL_36272 (CHEMBL648839)
Ki
8±n/a nM
Citation
 Higuchi, RIEdwards, JPCaferro, TRRinggenberg, JDKong, JWHamann, LGArienti, KLMarschke, KBDavis, RLFarmer, LJJones, TK 4-Alkyl- and 3,4-dialkyl-1,2,3,4-tetrahydro-8-pyridono[5,6-g]quinolines: potent, nonsteroidal androgen receptor agonists. Bioorg Med Chem Lett 9:1335-40 (1999)  
Target
Name:
Androgen receptor
Synonyms:
ANDR_HUMAN Androgen Receptor Androgen receptor/Baculoviral IAP repeat-containing protein 2 Dihydrotestosterone receptor Nuclear receptor subfamily 3 group C member 4
Type:
Receptor
Mol. Mass.:
99185.27
Organism:
Homo sapiens (Human)
Description:
CHO cells were stably transfected with human AR gene.
Residue:
920
  
Inhibitor
Name:
BDBM50077112
Synonyms:
CHEMBL27812 | Cis-(3aR,11bS)-10-Trifluoromethyl-1,2,3,3a,4,5,7,11b-octahydro-5,7-diaza-cyclopenta[a]anthracen-8-one
Type:
Small organic molecule
Emp. Form.:
C16H15F3N2O
Mol. Mass.:
308.2983
SMILES:
FC(F)(F)c1cc(=O)[nH]c2cc3NC[C@@H]4CCC[C@@H]4c3cc12
: