Target
Androgen receptor
Ligand
BDBM50077100
Substrate
Meas. Tech.
ChEMBL_36106 (CHEMBL648071)
IC50
>10000±n/a nM
Citation
 Higuchi, RIEdwards, JPCaferro, TRRinggenberg, JDKong, JWHamann, LGArienti, KLMarschke, KBDavis, RLFarmer, LJJones, TK 4-Alkyl- and 3,4-dialkyl-1,2,3,4-tetrahydro-8-pyridono[5,6-g]quinolines: potent, nonsteroidal androgen receptor agonists. Bioorg Med Chem Lett 9:1335-40 (1999)  
Target
Name:
Androgen receptor
Synonyms:
ANDR_HUMAN Androgen Receptor Androgen receptor/Baculoviral IAP repeat-containing protein 2 Dihydrotestosterone receptor Nuclear receptor subfamily 3 group C member 4
Type:
Receptor
Mol. Mass.:
99185.27
Organism:
Homo sapiens (Human)
Description:
CHO cells were stably transfected with human AR gene.
Residue:
920
  
Inhibitor
Name:
BDBM50077100
Synonyms:
6-Isobutyl-4-trifluoromethyl-6,7,8,9-tetrahydro-1H-pyrido[3,2-g]quinolin-2-one | CHEMBL282813
Type:
Small organic molecule
Emp. Form.:
C17H19F3N2O
Mol. Mass.:
324.3408
SMILES:
CC(C)CC1CCNc2cc3[nH]c(=O)cc(c3cc12)C(F)(F)F
: