Target
Glutamate receptor ionotropic, kainate 3
Ligand
BDBM50091474
Substrate
Meas. Tech.
ChEBML_90598
Ki
518±n/a nM
Citation
 Baker, SRBleakman, DEzquerra, JBallyk, BADeverill, MHo, KKamboj, RKCollado, IDomínguez, CEscribano, AMateo, AIPedregal, CRubio, A 4-Alkylidenyl glutamic acids, potent and selective GluR5 agonists. Bioorg Med Chem Lett 10:1807-10 (2000)  
Target
Name:
Glutamate receptor ionotropic, kainate 3
Synonyms:
EAA5 GLUR7 GRIK3_HUMAN Glutamate receptor 7 Glutamate receptor ionotropic kainate 3 Glutamate-Kainate 7
Type:
Enzyme Catalytic Domain
Mol. Mass.:
104046.44
Organism:
Homo sapiens (Human)
Description:
Glutamate-Kainate 7 0 HUMAN::Q13003
Residue:
919
  
Inhibitor
Name:
BDBM50091474
Synonyms:
(2S,4E)-2-amino-4-(2-methylpropylidene)pentanedioic acid LY-339637
Type:
Small organic molecule
Emp. Form.:
C9H15NO4
Mol. Mass.:
201.2197
SMILES:
CC(C)\C=C(/C[C@H](N)C(O)=O)C(O)=O
: