Target
Beta-lactamase
Ligand
BDBM50092271
Substrate
Meas. Tech.
ChEBML_41358
IC50
>700000±n/a nM
Citation
 Grant, EBGuiadeen, DBaum, EZFoleno, BDJin, HMontenegro, DANelson, EABush, KHlasta, DJ The synthesis and SAR of rhodanines as novel class C beta-lactamase inhibitors. Bioorg Med Chem Lett 10:2179-82 (2001)  
Target
Name:
Beta-lactamase
Synonyms:
Beta-lactamase TEM
Type:
PROTEIN
Mol. Mass.:
31512.33
Organism:
Enterobacter cloacae
Description:
ChEMBL_41358
Residue:
286
  
Inhibitor
Name:
BDBM50092271
Synonyms:
(Z)-5-Benzylidene-2-thioxothiazolidin-4-one 5-[1-Phenyl-meth-(Z)-ylidene]-2-thioxo-thiazolidin-4-one CHEMBL305763
Type:
Small organic molecule
Emp. Form.:
C10H7NOS2
Mol. Mass.:
221.299
SMILES:
SC1=NC(=O)C(S1)=Cc1ccccc1
: